{"text_format":"1","workbook":"xlsx","n_sheets":8,"sheets":["INGRESO DE DATOS","Tablas","Global Major Medical Health Pla","Global Select Health Plan","Global Premier Health Plan","Global Elite Health Plan","Global Ultimate Health Plan","Resumen tarifas"],"not_rendered":{"charts":0,"images":24,"macros":1,"external_links":1,"defined_names":6,"comments":1,"pivot_tables":0},"unopened":[],"bounds":{"document_bytes":16777216,"sheet_cells":100000,"rows_first":2000,"rows_last":500,"rows_between":2000,"halvings":0,"cell_chars":16384,"cell_head_chars":4096},"cells_cut":0,"cells_raw":0,"read":"whole","date_system":"1900"}

{"sheet":"INGRESO DE DATOS","index":0,"n_rows":25,"n_cols":10,"rows_kept":25,"cut":false,"hidden":false,"merged":[[10,0,10,7],[22,1,22,2],[16,1,16,2],[22,3,22,5],[14,3,14,7],[16,5,16,6],[14,1,14,2],[18,1,18,2],[18,5,18,6]]}
[]
[null,null,null,null,null,null,null," "," "]
[]
[]
[]
[null,null,null,null,null,null,null," "," "," "]
[]
[]
[]
[]
["Cotización de Seguro Médico - Bupa Global Health Plans"]
[]
["1. INGRESE LOS DATOS DEL PROPUESTO ASEGURADO :"]
[]
[null,"Nombre del asegurado titular :",null,"Nombre del Cliente"]
[]
[null,"Número de adultos en la póliza : ",null,2,null,"Número de hijos en la póliza :",null,0]
[]
[null," Edad del asegurado titular :",null,34,null,"Edad del (de la) cónyuge :",null,35]
[]
["2. INGRESE EL NOMBRE DE LA AGENCIA ASESORA :"]
[]
[null,"Agencia / Agente :",null,"Nombre del Agente"]
[]
["3. ESCOJA EL PRODUCTO PARA VISUALIZAR LA COTIZACION RESPECTIVA :"]

{"sheet":"Tablas","index":1,"n_rows":1504,"n_cols":31,"rows_kept":1504,"cut":false,"hidden":true,"merged":[[1124,0,1124,6],[1125,0,1125,6],[1126,0,1126,1],[1126,2,1126,6],[752,0,752,1],[752,2,752,6],[825,0,825,6],[826,0,826,6],[827,0,827,1],[827,2,827,6],[900,0,900,6],[901,0,901,6],[902,0,902,1],[902,2,902,6],[975,0,975,6],[976,0,976,1],[751,0,751,6],[675,0,675,6],[676,0,676,6],[677,0,677,1],[677,2,677,6],[750,0,750,6],[527,0,527,1],[527,2,527,6],[600,0,600,6],[601,0,601,6],[602,0,602,1],[602,2,602,6],[526,0,526,6],[450,0,450,6],[451,0,451,6],[452,0,452,1],[452,2,452,6],[525,0,525,6],[376,0,376,1],[376,2,376,6],[150,0,150,6],[151,0,151,6],[152,0,152,1],[152,2,152,6],[225,0,225,6],[226,0,226,1],[375,0,375,6],[226,2,226,6],[300,0,300,6],[301,0,301,6],[302,0,302,1],[302,2,302,6],[1,0,1,6],[2,0,2,6],[77,0,77,1],[77,2,77,6],[76,0,76,6],[3,0,3,1],[3,2,3,6],[976,2,976,6],[1049,0,1049,6],[1050,0,1050,6],[1051,0,1051,1],[1051,2,1051,6],[4,8,4,12],[1424,0,1424,6],[1425,0,1425,6],[1426,0,1426,1],[1426,2,1426,6],[1276,0,1276,1],[1276,2,1276,6],[1349,0,1349,6],[1350,0,1350,6],[1351,0,1351,1],[1351,2,1351,6],[1200,0,1200,6],[1201,0,1201,6],[1202,0,1202,1],[1202,2,1202,6],[1275,0,1275,6],[1438,28,1438,29],[1439,28,1439,29],[1440,28,1440,29],[2,20,2,23],[151,20,151,23],[301,20,301,23],[901,20,901,23],[1201,20,1201,23]]}
[]
["BUPA GLOBAL ELITE",null,null,null,null,null,null,null,"FACTOR MENSUAL:",null,9.2500000000000013E-2]
["TARIFAS ANUALES",null,null,null,null,null,null,null,"FACTOR TRIMESTRAL:",null,0.26874999999999999,null,null,null,null,null,null,null,null,null,1000]
["EDAD",null,null,null,null,null,null,null,"FACTOR SEMIANUAL:",null,0.52249999999999996,null,null,null,null,null,null,null,null,null,2,0,4.4999999999999998E-2]
[" "," ",1000,2000,3500,5000,10000,null,"THIS COLUMN IS FOR THE 5% DISCOUNT ",null,null,null,null,null,null,null,null,null,null,null,"tre","sum usa","recargos","cotizador"]
[18,null,111137.5,80237.5,62125,53937.5,41900,null,96337.5,69712.5,54087.5,47025,36650,null,true,true,true,true,true,null,20950,20950,942.75,21892.75]
[19,null,115450,83375,64550,56000,43537.5,null,100062.5,72400,56187.5,48812.5,38075,null,true,true,true,true,true,null,21768.75,21768.75,979.59375,22748.34375]
[20,null,120075,86700,67162.5,58275,45287.5,null,104037.5,75275,58425,50775,39575,null,true,true,true,true,true,null,22643.75,22643.75,1018.96875,23662.71875]
[21,null,124612.5,89975,69625,60412.5,46950,null,107950,78100,60550,52612.5,41012.5,null,true,true,true,true,true,null,23475,23475,1056.375,24531.375]
[22,null,128912.5,93050,72012.5,62512.5,48562.5,null,111662.5,80750,62612.5,54412.5,42400,null,true,true,true,true,true,null,24281.25,24281.25,1092.65625,25373.90625]
[23,null,133487.5,96375,74587.5,64712.5,50275,null,115587.5,83612.5,64825,56312.5,43875,null,true,true,true,true,true,null,25137.5,25137.5,1131.1875,26268.6875]
[24,null,137987.5,99587.5,77062.5,66887.5,51925,null,119475,86375,66975,58187.5,45312.5,null,true,true,true,true,true,null,25962.5,25962.5,1168.3125,27130.8125]
[25,null,142287.5,102662.5,79450,68962.5,53550,null,123187.5,89037.5,69025,59975,46700,null,true,true,true,true,true,null,26775,26775,1204.875,27979.875]
[26,null,146825,105975,82000,71162.5,55275,null,127100,91887.5,71225,61875,48187.5,null,true,true,true,true,true,null,27637.5,27637.5,1243.6875,28881.1875]
[27,null,151350,109237.5,84525,73362.5,56962.5,null,131000,94687.5,73400,63762.5,49650,null,true,true,true,true,true,null,28481.25,28481.25,1281.65625,29762.90625]
[28,null,156000,112525,87112.5,75575,58700,null,135000,97525,75625,65675,51137.5,null,true,true,true,true,true,null,29350,29350,1320.75,30670.75]
[29,null,161875,116762.5,90375,78412.5,60887.5,null,140075,101187.5,78437.5,68125,53025,null,true,true,true,true,true,null,30443.75,30443.75,1369.96875,31813.71875]
[30,null,168000,121200,93737.5,81337.5,63175,null,145362.5,105012.5,81337.5,70662.5,55000,null,true,true,true,true,true,null,31587.5,31587.5,1421.4375,33008.9375]
[31,null,174087.5,125600,97175,84287.5,65475,null,150587.5,108800,84300,73200,56975,null,true,true,true,true,true,null,32737.5,32737.5,1473.1875,34210.6875]
[32,null,180312.5,130050,100612.5,87312.5,67787.5,null,155975,112637.5,87262.5,75800,58975,null,true,true,true,true,true,null,33893.75,33893.75,1525.21875,35418.96875]
[33,null,184025,132737.5,102662.5,89075,69150,null,159162.5,114950,89037.5,77312.5,60150,null,true,true,true,true,true,null,34575,34575,1555.875,36130.875]
[34,null,187962.5,135575,104850,90962.5,70625,null,162550,117387.5,90900,78950,61412.5,null,true,true,true,true,true,null,35312.5,35312.5,1589.0625,36901.5625]
[35,null,191837.5,138362.5,107025,92850,72087.5,null,165900,119800,92787.5,80575,62675,null,true,true,true,true,true,null,36043.75,36043.75,1621.96875,37665.71875]
[36,null,195737.5,141187.5,109175,94712.5,73537.5,null,169262.5,122237.5,94650,82175,63937.5,null,true,true,true,true,true,null,36768.75,36768.75,1654.59375,38423.34375]
[37,null,199625,143975,111337.5,96575,75000,null,172612.5,124637.5,96512.5,83787.5,65187.5,null,true,true,true,true,true,null,37500,37500,1687.5,39187.5]
[38,null,203025,146412.5,113200,98200,76250,null,175550,126737.5,98112.5,85187.5,66262.5,null,true,true,true,true,true,null,38125,38125,1715.625,39840.625]
[39,null,206187.5,148737.5,115000,99775,77462.5,null,178275,128737.5,99675,86550,67312.5,null,true,true,true,true,true,null,38731.25,38731.25,1742.90625,40474.15625]
[40,null,209550,151125,116900,101400,78712.5,null,181162.5,130812.5,101300,87937.5,68387.5,null,true,true,true,true,true,null,39356.25,39356.25,1771.03125,41127.28125]
[41,null,212862.5,153475,118700,102950,79912.5,null,184012.5,132825,102850,89287.5,69425,null,true,true,true,true,true,null,39956.25,39956.25,1798.03125,41754.28125]
[42,null,216175,155925,120575,104587.5,81200,null,186887.5,134937.5,104475,90687.5,70537.5,null,true,true,true,true,true,null,40600,40600,1827,42427]
{"$rows_left_out":1475}
{"sheet":"Global Major Medical Health Pla","index":2,"n_rows":78,"n_cols":15,"rows_kept":78,"cut":false,"hidden":false,"merged":[[30,10,30,11],[45,0,46,0],[45,6,46,6],[22,0,22,6],[34,3,34,4],[36,3,36,4],[38,2,38,3],[38,4,38,5],[30,2,30,8],[32,2,32,8],[31,10,31,11],[32,10,32,11],[34,10,34,13],[35,10,35,11],[36,10,36,11],[37,10,37,11],[38,10,38,11],[39,10,39,11],[40,10,40,11],[41,10,41,11],[43,10,43,13],[44,10,44,11],[45,10,45,11],[46,10,46,11],[47,10,47,11],[48,10,48,11],[49,10,49,11],[50,10,50,11],[51,10,51,11],[52,10,52,11],[54,10,54,13],[55,10,55,11],[56,10,56,11],[57,10,57,11],[58,10,58,11],[59,10,59,11],[60,10,60,11],[61,10,61,11],[62,10,62,11],[63,10,63,11],[65,10,65,13],[66,10,66,11],[67,10,67,11],[68,10,68,11],[69,10,69,11],[76,1,76,7],[77,1,77,13],[70,10,70,11],[71,10,71,11],[72,10,72,11],[73,10,73,11],[74,10,74,11]]}
[]
[]
[null,null,null,null,null,null,null,null,null,null,null,null," "," "," "]
[]
[]
[]
[null,null,null,null,null,null,null,null,null,null,null,null," "," "," "]
[]
[]
[]
[]
[]
[]
[]
[]
[]
[]
[]
[]
[]
[]
[]
[]
[]
[]
[]
[]
[null,null,null,null,null,null,null,null,null,null,null,null," "," "," "]
[]
[null,null,null,null,null,null,null,null,null,null,null," ",false]
{"$rows_left_out":49}
{"sheet":"Global Select Health Plan","index":3,"n_rows":81,"n_cols":15,"rows_kept":81,"cut":false,"hidden":false,"merged":[[22,0,22,1],[36,10,36,14],[43,10,43,11],[45,10,45,14],[28,0,28,1],[41,2,41,3],[32,10,32,11],[38,10,38,11],[32,2,32,8],[34,2,34,8],[33,10,33,11],[34,10,34,11],[37,10,37,11],[39,10,39,11],[40,10,40,11],[41,10,41,11],[47,0,48,0],[47,1,48,1],[54,10,54,11],[65,10,65,11],[56,10,56,14],[47,10,47,11],[48,10,48,11],[49,10,49,11],[50,10,50,11],[51,10,51,11],[52,10,52,11],[53,10,53,11],[57,10,57,11],[58,10,58,11],[62,10,62,11],[63,10,63,11],[42,10,42,11],[46,10,46,11],[59,10,59,11],[60,10,60,11],[61,10,61,11],[80,1,80,14],[64,10,64,11],[68,10,68,11],[69,10,69,11],[70,10,70,11],[71,10,71,11],[67,10,67,14],[76,10,76,11],[72,10,72,11],[73,10,73,11],[74,10,74,11],[75,10,75,11],[79,1,79,9]]}
[]
[]
[null,null,null,null,null,null,null,null,null,null,null,null," "," "," "]
[]
[]
[]
[null,null,null,null,null,null,null,null,null,null,null,null," "," "," "]
[]
[]
[]
[]
[]
[]
[]
[]
[]
[]
[]
[]
[]
[]
[]
[]
[]
[]
[]
[]
[]
[]
[]
{"$rows_left_out":52}
{"sheet":"Global Premier Health Plan","index":4,"n_rows":83,"n_cols":17,"rows_kept":83,"cut":false,"hidden":false,"merged":[[35,11,35,12],[39,11,39,16],[35,2,35,8],[37,2,37,8],[36,11,36,12],[37,11,37,12],[50,1,51,1],[50,0,51,0],[25,0,25,1],[43,2,43,3],[43,4,43,5],[57,11,57,12],[68,11,68,12],[79,11,79,12],[48,11,48,16],[59,11,59,16],[52,11,52,12],[53,11,53,12],[54,11,54,12],[55,11,55,12],[56,11,56,12],[60,11,60,12],[61,11,61,12],[62,11,62,12],[63,11,63,12],[64,11,64,12],[65,11,65,12],[40,11,40,12],[41,11,41,12],[42,11,42,12],[43,11,43,12],[44,11,44,12],[45,11,45,12],[49,11,49,12],[50,11,50,12],[51,11,51,12],[46,11,46,12],[66,11,66,12],[67,11,67,12],[71,11,71,12],[72,11,72,12],[73,11,73,12],[74,11,74,12],[70,11,70,16],[81,1,81,16],[82,1,85,16],[75,11,75,12],[76,11,76,12],[77,11,77,12],[78,11,78,12]]}
[]
[]
[]
[]
[]
[null,null,null,null,null,null,null,null,null,null,null,null,null," "," "," "]
[]
[]
[]
[null,null,null,null,null,null,null,null,null,null,null,null,null," "," "," "]
[]
[]
[]
[]
[]
[]
[]
[]
[]
[]
[]
[]
[]
[]
[]
[]
[]
[]
[]
[]
{"$rows_left_out":54}
{"sheet":"Global Elite Health Plan","index":5,"n_rows":73,"n_cols":57,"rows_kept":73,"cut":false,"hidden":false,"merged":[[35,10,35,11],[36,10,36,11],[39,10,39,11],[40,10,40,11],[41,10,41,11],[40,2,41,2],[40,1,41,1],[60,10,60,16],[49,10,49,16],[38,10,38,16],[42,10,42,11],[43,10,43,11],[44,10,44,11],[45,10,45,11],[56,10,56,11],[57,10,57,11],[58,10,58,11],[47,10,47,11],[46,10,46,11],[51,10,51,11],[52,10,52,11],[33,2,33,4],[25,2,25,8],[27,2,27,8],[29,10,29,16],[27,10,27,11],[26,10,26,11],[25,10,25,11],[30,10,30,11],[31,10,31,11],[72,1,75,16],[29,4,29,5],[31,4,31,5],[31,1,31,2],[29,1,29,2],[71,1,71,16],[61,10,61,11],[62,10,62,11],[63,10,63,11],[64,10,64,11],[65,10,65,11],[66,10,66,11],[67,10,67,11],[32,10,32,11],[33,10,33,11],[34,10,34,11],[68,10,68,11],[69,10,69,11],[50,10,50,11],[53,10,53,11],[54,10,54,11],[55,10,55,11]]}
[]
[]
[]
[]
[]
[]
[]
[]
[null,null,null,null,null,null,null,null,null,null,null,null,null,null,null,null,null,null,null,null,null,null,null,null,null,null,null,null,null,null,null,null,null,null,null,null,null,null,null,null,null,null,null,null,null,null,null,null,null,null,null,null,null,null,null,null," "]
[]
[]
[]
[null,null,null,null,null,null,null,null,null,null,null,null,null," "," "," "]
[]
[]
[]
[]
[]
[]
[]
[]
[]
[]
[]
[]
[null,"Nombre del asegurado titular :",{"$f":"+'INGRESO DE DATOS'!$D$15","v":"Nombre del Cliente"},null,null,null,null,null,null,null,"Deducibles",null,"PLAN 1","PLAN 2","PLAN 3","PLAN 4","PLAN 5"]
[null,null,null,null,null,null,null,null,null,null,"Dentro del país de residencia",null,1000,2000,3500,5000,10000]
[null,"Agencia / Agente :",{"$f":"+'INGRESO DE DATOS'!$D$23","v":"Nombre del Agente"},null,null,null,null,null,null,null,"Fuera del país de residencia",null,1000,2000,3500,5000,10000]
[]
[null,"Número de adultos en la póliza : ",null,{"$f":"+'INGRESO DE DATOS'!$D$17","v":2}," Edad del asegurado titular :",null,{"$f":"+'INGRESO DE DATOS'!$D$19","v":34},null,{"$f":"VLOOKUP($D$30,Tablas!A1503:B1504,2,0)","v":625},null,"TARIFAS ANUALES"]
{"$rows_left_out":44}
{"sheet":"Global Ultimate Health Plan","index":6,"n_rows":68,"n_cols":16,"rows_kept":68,"cut":false,"hidden":false,"merged":[[45,11,45,12],[46,11,46,12],[47,11,47,12],[48,11,48,12],[49,11,49,12],[30,11,30,12],[33,11,33,12],[34,11,34,12],[35,11,35,12],[44,11,44,12],[35,6,36,6],[35,7,36,7],[23,11,23,15],[32,11,32,15],[43,11,43,15],[36,11,36,12],[37,11,37,12],[38,11,38,12],[39,11,39,12],[40,11,40,12],[41,11,41,12],[25,11,25,12],[26,11,26,12],[27,11,27,12],[28,11,28,12],[29,11,29,12],[25,4,25,5],[19,2,19,8],[21,2,21,8],[23,1,23,2],[25,1,25,2],[19,11,19,12],[20,11,20,12],[21,11,21,12],[24,11,24,12],[23,4,23,5],[50,11,50,12],[51,11,51,12],[52,11,52,12],[55,11,55,12],[56,11,56,12],[54,11,54,15],[57,11,57,12],[58,11,58,12],[59,11,59,12],[67,1,70,16],[60,11,60,12],[61,11,61,12],[62,11,62,12],[63,11,63,12],[66,1,66,16]]}
[]
[]
[]
[]
[]
[]
[]
[null,null,null,null,null,null,null,null,null,null,null,null,null," "," "," "]
[]
[]
[]
[null,null,null,null,null,null,null,null,null,null,null,null,null," "," "," "]
[]
[]
[]
[]
[]
[]
[null,null,null,null,null,null,null,null,null,null,null,null," ",false]
[null,"Nombre del asegurado titular :",{"$f":"+'INGRESO DE DATOS'!$D$15","v":"Nombre del Cliente"},null,null,null,null,null,null,null,null,"Deducibles",null,"PLAN 1","PLAN 2","PLAN 3"]
[null,null,null,null,null,null,null,null,null,null,null,"Dentro del país de residencia",null,0,1000,2000]
[null,"Agencia / Agente :",{"$f":"+'INGRESO DE DATOS'!$D$23","v":"Nombre del Agente"},null,null,null,null,null,null,null,null,"Fuera del país de residencia",null,0,1000,2000]
[]
[null,"Número de adultos en la póliza : ",null,{"$f":"+'INGRESO DE DATOS'!$D$17","v":2}," Edad del asegurado titular :",null,{"$f":"+'INGRESO DE DATOS'!$D$19","v":34},{"$f":"VLOOKUP($D$24,Tablas!A1503:B1504,2,0)","v":625},null,null,null,"TARIFAS ANUALES"]
[null,null,null,null,null,null,null,null,null,null,null,"Prima del asegurado titular :",null,{"$f":"VLOOKUP($G$24,Tablas!$A$1205:$G$1271,3,TRUE)+625","v":456200},{"$f":"VLOOKUP($G$24,Tablas!$A$1205:$G$1271,4,TRUE)+625","v":297837.5},{"$f":"VLOOKUP($G$24,Tablas!$A$1205:$G$1271,5,TRUE)+625","v":214187.5}]
[null,"Número de hijos en la póliza :",null,{"$f":"+'INGRESO DE DATOS'!$H$17","v":0},"Edad del (de la) cónyuge :",null,{"$f":"+'INGRESO DE DATOS'!$H$19","v":35},null,null,null,null,"Prima del (de la) cónyuge:",null,{"$f":"IF($D$24=1,0,(VLOOKUP($G$26,Tablas!$A$1205:$G$1271,3,TRUE)))+($H$24)","v":465675},{"$f":"IF($D$24=1,0,(VLOOKUP($G$26,Tablas!$A$1205:$G$1271,4,TRUE)))+($H$24)","v":304000},{"$f":"IF($D$24=1,0,(VLOOKUP($G$26,Tablas!$A$1205:$G$1271,5,TRUE)))+($H$24)","v":218575}]
[null,null,null,null,null,null,null,null,null,null,null,"Prima del (de los) Hijo (s) :",null,{"$f":"IF($D$26=0,0,(VLOOKUP(D26,Tablas!$A$1272:$G$1274,3,TRUE)))","v":0},{"$f":"IF(D26=0,0,(VLOOKUP(D26,Tablas!$A$1272:$G$1274,4,TRUE)))","v":0},{"$f":"IF(D26=0,0,(VLOOKUP(D26,Tablas!$A$1272:$G$1274,5,TRUE)))","v":0}]
[null,null,null,null,"FECHA DE COTIZACION :",null,null,null,null,null,null,"TOTAL PRIMA NETA :",null,{"$f":"SUM(N25:N27)","v":921875},{"$f":"SUM(O25:O27)","v":601837.5},432762.5]
[null,null,null,null,{"$f":"NOW()","v":"2021-01-13T13:38:21.570"},null,null,null,null,null,null,"Costo administrativo anual :",null,937.5,937.5,937.5]
[null,null,null,null,null,null,null,null,null,null,null,"IVA (16%) :",null,{"$f":"+N28*16%","v":147500},{"$f":"+O28*16%","v":96294},{"$f":"+P28*16%","v":69242}]
{"$rows_left_out":39}
{"sheet":"Resumen tarifas","index":7,"n_rows":113,"n_cols":7,"rows_kept":113,"cut":false,"hidden":false,"merged":[[56,0,56,1],[65,0,65,1],[66,0,66,1],[59,0,59,1],[60,0,60,1],[61,0,61,1],[62,0,62,1],[63,0,63,1],[64,0,64,1],[16,0,16,6],[18,0,18,1],[22,4,22,5],[25,4,25,5],[55,0,55,1],[18,2,18,6],[20,2,20,6],[20,0,20,1],[22,0,22,1],[25,0,25,1],[40,0,40,1],[41,0,41,1],[44,0,44,1],[45,0,45,1],[46,0,46,1],[50,0,50,1],[86,2,86,4],[78,0,78,1],[72,0,72,1],[73,0,73,1],[74,0,74,1],[75,0,75,1],[79,0,79,1],[83,0,83,1],[86,0,86,1],[74,2,74,5],[76,2,76,5],[78,2,78,5],[76,0,76,1],[69,0,69,1],[77,0,77,1],[59,2,59,6],[61,2,61,6],[63,2,63,6],[65,2,65,6],[72,2,72,5],[87,0,87,1],[91,0,91,1],[88,0,88,1],[101,0,101,1],[101,2,101,3],[96,0,96,1],[89,0,89,1],[90,0,90,1],[92,0,92,1],[93,0,93,1],[90,2,90,4],[92,2,92,4],[88,2,88,4],[51,0,51,1],[47,0,47,1],[48,0,48,1],[49,0,49,1],[112,0,115,6],[106,0,106,1],[102,0,102,1],[103,0,103,1],[103,2,103,3],[104,0,104,1],[105,0,105,1],[105,2,105,3],[110,0,110,6],[99,0,99,1],[99,2,99,3],[100,0,100,1]]}
[" "]
[null,null,null,null," "," "]
[]
[]
[]
[null,null,null,null," "," "," "]
[]
[]
[]
[]
[]
[]
[]
[]
[]
[]
["Cotización de Seguro Médico - Bupa Global Health Plans"]
[]
["Nombre del asegurado titular :",null,{"$f":"+'INGRESO DE DATOS'!$D$15","v":"Nombre del Cliente"}]
[]
["Agencia / Agente :",null,{"$f":"+'INGRESO DE DATOS'!$D$23","v":"Nombre del Agente"}]
[]
["Número de adultos en la póliza : ",null,2,null," Edad del asegurado titular :",null,{"$f":"+'INGRESO DE DATOS'!$D$19","v":34}]
[]
[]
["Número de hijos en la póliza :",null,{"$f":"+'INGRESO DE DATOS'!$H$17","v":0},null,"Edad del (de la) cónyuge :",null,{"$f":"+'INGRESO DE DATOS'!$H$19","v":35}]
[]
[]
[null,null,null,"FECHA DE COTIZACION :",{"$f":"NOW()","v":"2021-01-13T13:38:21.570"}]
[]
{"$rows_left_out":83}